problem building Namd frm source...

From: hl332_at_drexel.edu
Date: Thu Jun 07 2007 - 12:32:18 CDT

Hi,
 I have been trying to build a complete namd binary from source. I was following the steps given in notes.txl file of NAMD-2.6 and got error at this point:Build and test the Charm++/Converse library:
The error messages are following. If someone can help, it would do great. I never built anything like this before any time. This is my first time and I am still learning. The error messages are following:
===================================
gmake[2]: Leaving directory `/home/harish/namd/NAMD_2.6_Source/charm-5.9/net-linux/tmp/libs/ck-libs/multicast'
../bin/charmc -O -DCMK_OPTIMIZE=1 -nobs -c -I. ComlibManager.C
MsgPacker.h:86: error: extra qualification ‘MsgPacker::’ on member ‘MsgPacker’
Fatal Error by charmc in directory /home/harish/namd/NAMD_2.6_Source/charm-5.9/net-linux/tmp
   Command g++ -I../bin/../include -D__CHARMC__=1 -DCMK_OPTIMIZE=1 -I. -O -c ComlibManager.C -o ComlibManager.o returned error code 1
charmc exiting...
gmake[1]: *** [ComlibManager.o] Error 1
gmake[1]: Leaving directory `/home/harish/namd/NAMD_2.6_Source/charm-5.9/net-linux/tmp'
gmake: *** [charm++] Error 2
-------------------------------------------------
Charm++ NOT BUILT. Either cd into net-linux/tmp and try
to resolve the problems yourself, visit
    http://charm.cs.uiuc.edu/
for more information. Otherwise, email the developers at ppl_at_cs.uiuc.edu
============================

Regards
Harish
-------------------------------------------------
Harish Vashisth (Ph.D Candidate)
CAT-361,Chemical & Biological Engg.
Drexel University, Philadelphia, PA
office: 215-895-5823

This archive was generated by hypermail 2.1.6 : Wed Feb 29 2012 - 15:46:27 CST